{"text_format":"3","workbook":"xlsx","n_sheets":6,"sheets":["ENTIDADES","CumpSARAS","CUMPLIMIENTOS","ESTRUCTURA__NORMA","CONTSEGART9","SEG"],"not_rendered":{"images":4,"macros":1,"defined_names":1},"read":"whole","date_system":"1900"}

{"sheet":"ENTIDADES","index":0,"n_rows":1038,"n_cols":4,"rows_kept":1038,"hidden":true}
["RUC","RAZON SOCIAL","ESTADO JURIDICO","SEGMENTO"]
["0990846685001","COOPERATIVA DE AHORRO Y CREDITO NUESTRA SEÑORA DE LAS MERCEDES LTDA EN LIQUIDACION","EXTINTA","SEGMENTO 4"]
["0891704305001","COOPERATIVA DE AHORRO Y CREDITO NUESTROS ABUELOS LTDA EN LIQUIDACION","EXTINTA","SIN SEGMENTO"]
["1792311667001","COOPERATIVA DE AHORRO Y CREDITO NEGOCIOS ANDINOS LTDA","ACTIVA","SEGMENTO 3"]
["0691730573001","COOPERATIVA DE AHORRO Y CREDITO NIZAG LTDA","ACTIVA","SEGMENTO 4"]
["1792088380001","COOPERATIVA DE AHORRO Y CREDITO NUEVA ESPERANZA EN LIQUIDACION","EXTINTA","SEGMENTO 5"]
["0691720721001","COOPERATIVA DE AHORRO Y CREDITO NUEVA ESPERANZA LTDA","ACTIVA","SEGMENTO 3"]
["1891725732001","COOPERATIVA DE AHORRO Y CREDITO NUEVA ALIANZA AMBATILLO LTDA","EXTINTA","SEGMENTO 5"]
{"$rows_left_out":1031}
{"sheet":"CumpSARAS","index":1,"n_rows":77,"n_cols":161,"rows_kept":77,"merged":[[0,2,0,9],[1,1,1,11],[2,1,2,11],[3,2,3,3],[3,5,3,11],[4,1,4,11],[5,1,5,11],[6,1,6,11],[7,1,7,11],[10,2,10,11],[12,3,12,11],[14,0,14,11],[15,4,15,5],[15,6,15,7],[16,1,29,1],[17,2,17,11],[30,1,38,1],[30,2,30,11],[39,1,55,1],[40,2,41,2],[43,2,48,2],[49,2,52,2],[53,2,54,2],[56,1,63,1],[56,2,56,11],[64,1,65,1],[66,1,66,10],[67,0,67,11],[68,1,68,11],[69,1,69,10],[70,1,70,10],[71,1,71,10],[72,1,72,10],[73,1,73,10],[74,1,74,10],[75,1,75,10],[76,1,76,10]]}
[null,null,"Herramienta para la presentación del Informe de Cumplimiento de la Norma SARAS, sobre la implementación del sistema de Administración de Riesgos Ambientales y Sociales en las Cooperativas de ahorro y Crédito y Mutualistas"]
[null,"Descripción general de la herramienta"]
[null,"La presente herramienta es un formulario que se utilizará para evaluar el cumplimiento de la Norma SARAS. Otorga una calificación del nivel de incorporación de la Norma y permite identificar los elementos que aún no han sido incorporados por parte de la Entidad."]
[null,"Usuario ","Este formulario debe ser llenado por el auditor interno, el área o quien cumpla estas funciones de acuerdo con el segmento al que pertenece la Entidad.",null,"Alcance","Esta herramienta es una evaluación del cumplimiento de la Norma SARAS en cuanto los requerimientos explícitos que deben ser desarrollados por la Entidad. No evalúa a la entidad sobre la gestión de riesgos ambientales y social, sino que califica el nivel en el que la Entidad ha incorporado los requerimientos de la Norma SARAS, facilitando la identificación de los aspectos que deben completarse. "]
[null,"Marco metodológico:"]
[null,"Los criterios se organizan de acuerdo con cada artículo de las solicitudes explícitas.\nPara no perder los elementos cualitativos, esta herramienta incluye una columna que permite describir el cumplimiento, el estado del proceso, una justificación o recomendación sobre el cumplimiento de la norma.\nSe priorizó tener una herramienta que identifique el cumplimiento por artículos de forma eficiente, comparable y operativa.\nEsta herramienta incluye específicamente los requerimientos explícitos de la norma que deben ser cumplidos por las Entidades. Por lo que la calificación obtenida sí es una valoración del nivel de cumplimiento de la Norma SARAS por parte de la Entidad."]
[null,"Descripción del uso de la herramienta:"]
[null,"1.  En las Celdas de color rojo ingresar el RUC de la Entidad y el año de reporte.  \n2. Esta herramienta cuenta con un Check List que debe ser llenado con un \"Sí\" o con un \"No\" de acuerdo con la incorporación del aspecto por parte de la Entidad.\n    En la casilla de  descripción de cumplimiento se debe describir el cumplimiento, el estado del proceso, una justificación o recomendación. \n     En la columna de verificación se muestra la evidencia que debe ser entregada con el formulario para validar y comprobar el cumplimiento.\n     La columna de calificación no debe ser modificada y muestra la calificación otorgada para cada criterio. Al final se muestra una suma de la calificación de cada criterio sobre 47 puntos. \n3. Finalmente, se deberá incluir en la seccion final una descripción de actividades que se desarrollarán el año entrante para mejorar el SARAS y el presupuesto asignado.\n\nNota: Dentro del formulario no se puede utilizar el apostrofe ( ' ), el mismo puede provocar errores de acopio. "]
{"$rows_left_out":70}
{"sheet":"CUMPLIMIENTOS","index":2,"n_rows":49,"n_cols":11,"rows_kept":49,"hidden":true}
["codUnico","normaId","calificacion","descripcion","estadoReg","fechaCreacion","fechaActualizacion","usrCreacion","VALIDACION",null,"NERROR"]
[{"$f":"CONCATENATE(CumpSARAS!$C$10,CumpSARAS!$L$10)","v":"07900886110012025"},1,{"$f":"VLOOKUP($B2,CumpSARAS!$A$16:$L$67,12,FALSE)","v":1},{"$f":"VLOOKUP($B2,CumpSARAS!$A$16:$L$67,10,FALSE)","v":"ACTA N° 410"},"ACT",{"$f":"TODAY()","v":"2026-04-17"},{"$f":"TODAY()","v":"2026-04-17"},{"$f":"CumpSARAS!$L$12","v":"ILOPEZ"},{"$f":"IF(T_CUMPLIMIENTOS[normaId]=48,\"VALIDADO\",IF(AND(OR(T_CUMPLIMIENTOS[[#This Row],[calificacion]]=0,T_CUMPLIMIENTOS[[#This Row],[calificacion]]=1),OR(T_CUMPLIMIENTOS[[#This Row],[descripcion]]<>\"\"),T_CUMPLIMIENTOS[[#This Row],[descripcion]]<>0),\"VALIDADO\",\"ERROR\"))","v":"VALIDADO"},null,{"$f":"IF(COUNTIF(T_CUMPLIMIENTOS[VALIDACION],\"ERROR\")=0,\"VALIDADO\",\"ERROR\")","v":"VALIDADO"}]
[{"$f":"CONCATENATE(CumpSARAS!$C$10,CumpSARAS!$L$10)","v":"07900886110012025"},2,{"$f":"VLOOKUP($B3,CumpSARAS!$A$16:$L$67,12,FALSE)","v":1},{"$f":"VLOOKUP($B3,CumpSARAS!$A$16:$L$67,10,FALSE)","v":"Articulo 16/ACTA N° 410"},"ACT","2026-04-17","2026-04-17",{"$f":"CumpSARAS!$L$12","v":"ILOPEZ"},{"$f":"IF(T_CUMPLIMIENTOS[normaId]=48,\"VALIDADO\",IF(AND(OR(T_CUMPLIMIENTOS[[#This Row],[calificacion]]=0,T_CUMPLIMIENTOS[[#This Row],[calificacion]]=1),OR(T_CUMPLIMIENTOS[[#This Row],[descripcion]]<>\"\"),T_CUMPLIMIENTOS[[#This Row],[descripcion]]<>0),\"VALIDADO\",\"ERROR\"))","v":"VALIDADO"}]
[{"$f":"CONCATENATE(CumpSARAS!$C$10,CumpSARAS!$L$10)","v":"07900886110012025"},3,{"$f":"VLOOKUP($B4,CumpSARAS!$A$16:$L$67,12,FALSE)","v":1},{"$f":"VLOOKUP($B4,CumpSARAS!$A$16:$L$67,10,FALSE)","v":"Articulo 18-19-20/ACTA N° 410"},"ACT","2026-04-17","2026-04-17",{"$f":"CumpSARAS!$L$12","v":"ILOPEZ"},{"$f":"IF(T_CUMPLIMIENTOS[normaId]=48,\"VALIDADO\",IF(AND(OR(T_CUMPLIMIENTOS[[#This Row],[calificacion]]=0,T_CUMPLIMIENTOS[[#This Row],[calificacion]]=1),OR(T_CUMPLIMIENTOS[[#This Row],[descripcion]]<>\"\"),T_CUMPLIMIENTOS[[#This Row],[descripcion]]<>0),\"VALIDADO\",\"ERROR\"))","v":"VALIDADO"}]
[{"$f":"CONCATENATE(CumpSARAS!$C$10,CumpSARAS!$L$10)","v":"07900886110012025"},4,{"$f":"VLOOKUP($B5,CumpSARAS!$A$16:$L$67,12,FALSE)","v":1},{"$f":"VLOOKUP($B5,CumpSARAS!$A$16:$L$67,10,FALSE)","v":"Articulo 21-22/ACTA N° 410"},"ACT","2026-04-17","2026-04-17",{"$f":"CumpSARAS!$L$12","v":"ILOPEZ"},{"$f":"IF(T_CUMPLIMIENTOS[normaId]=48,\"VALIDADO\",IF(AND(OR(T_CUMPLIMIENTOS[[#This Row],[calificacion]]=0,T_CUMPLIMIENTOS[[#This Row],[calificacion]]=1),OR(T_CUMPLIMIENTOS[[#This Row],[descripcion]]<>\"\"),T_CUMPLIMIENTOS[[#This Row],[descripcion]]<>0),\"VALIDADO\",\"ERROR\"))","v":"VALIDADO"}]
[{"$f":"CONCATENATE(CumpSARAS!$C$10,CumpSARAS!$L$10)","v":"07900886110012025"},5,{"$f":"VLOOKUP($B6,CumpSARAS!$A$16:$L$67,12,FALSE)","v":1},{"$f":"VLOOKUP($B6,CumpSARAS!$A$16:$L$67,10,FALSE)","v":"Articulo 29/ACTA N° 410"},"ACT","2026-04-17","2026-04-17",{"$f":"CumpSARAS!$L$12","v":"ILOPEZ"},{"$f":"IF(T_CUMPLIMIENTOS[normaId]=48,\"VALIDADO\",IF(AND(OR(T_CUMPLIMIENTOS[[#This Row],[calificacion]]=0,T_CUMPLIMIENTOS[[#This Row],[calificacion]]=1),OR(T_CUMPLIMIENTOS[[#This Row],[descripcion]]<>\"\"),T_CUMPLIMIENTOS[[#This Row],[descripcion]]<>0),\"VALIDADO\",\"ERROR\"))","v":"VALIDADO"}]
[{"$f":"CONCATENATE(CumpSARAS!$C$10,CumpSARAS!$L$10)","v":"07900886110012025"},6,{"$f":"VLOOKUP($B7,CumpSARAS!$A$16:$L$67,12,FALSE)","v":1},{"$f":"VLOOKUP($B7,CumpSARAS!$A$16:$L$67,10,FALSE)","v":"Articulo 23/ACTA N° 410"},"ACT","2026-04-17","2026-04-17",{"$f":"CumpSARAS!$L$12","v":"ILOPEZ"},{"$f":"IF(T_CUMPLIMIENTOS[normaId]=48,\"VALIDADO\",IF(AND(OR(T_CUMPLIMIENTOS[[#This Row],[calificacion]]=0,T_CUMPLIMIENTOS[[#This Row],[calificacion]]=1),OR(T_CUMPLIMIENTOS[[#This Row],[descripcion]]<>\"\"),T_CUMPLIMIENTOS[[#This Row],[descripcion]]<>0),\"VALIDADO\",\"ERROR\"))","v":"VALIDADO"}]
[{"$f":"CONCATENATE(CumpSARAS!$C$10,CumpSARAS!$L$10)","v":"07900886110012025"},7,{"$f":"VLOOKUP($B8,CumpSARAS!$A$16:$L$67,12,FALSE)","v":1},{"$f":"VLOOKUP($B8,CumpSARAS!$A$16:$L$67,10,FALSE)","v":"SECCION I-ACTA N°410"},"ACT","2026-04-17","2026-04-17",{"$f":"CumpSARAS!$L$12","v":"ILOPEZ"},{"$f":"IF(T_CUMPLIMIENTOS[normaId]=48,\"VALIDADO\",IF(AND(OR(T_CUMPLIMIENTOS[[#This Row],[calificacion]]=0,T_CUMPLIMIENTOS[[#This Row],[calificacion]]=1),OR(T_CUMPLIMIENTOS[[#This Row],[descripcion]]<>\"\"),T_CUMPLIMIENTOS[[#This Row],[descripcion]]<>0),\"VALIDADO\",\"ERROR\"))","v":"VALIDADO"}]
{"$rows_left_out":42}
{"sheet":"ESTRUCTURA__NORMA","index":3,"n_rows":48,"n_cols":12,"rows_kept":48,"hidden":true}
["id","norma","resolucion","numArticulo","articulo","elemento","criterio","verificacion","estadoReg","fechaCreacion","fechaActualizacion","usrCreacion"]
[1,"SARAS","SEPS-IGT-IGS-IGJ-INFMR-INR-INGINT-2022-003",5," Política de Administración de Riesgos Ambientales y Sociales.","Párrafo 1","¿Existe una política SARAS aprobada en la entidad?","Resolución del Consejo de Administración","ACT",{"$f":"TODAY()","v":"2026-04-17"},{"$f":"TODAY()","v":"2026-04-17"},"ILOPEZ"]
[2,"SARAS","SEPS-IGT-IGS-IGJ-INFMR-INR-INGINT-2022-003",5," Política de Administración de Riesgos Ambientales y Sociales.","Literal a)","Una declaración inicial que enfatice el compromiso del consejo de administración y Gerencia con la sostenibilidad","Artículo de la Política SARAS y resolución del Consejo de Administración","ACT","2026-04-17","2026-04-17","ILOPEZ"]
[3,"SARAS","SEPS-IGT-IGS-IGJ-INFMR-INR-INGINT-2022-003",5," Política de Administración de Riesgos Ambientales y Sociales.","Literal b)","Principios y marco conceptual en los que se fundamenta el documento","Artículo de la Política SARAS y resolución del Consejo de Administración","ACT","2026-04-17","2026-04-17","ILOPEZ"]
[4,"SARAS","SEPS-IGT-IGS-IGJ-INFMR-INR-INGINT-2022-003",5," Política de Administración de Riesgos Ambientales y Sociales.","literal c)","Las normativas ambientales del país y los estándares internacionales que se consideran como base y fuentes de referencia","Artículo de la Política SARAS y resolución del Consejo de Administración","ACT","2026-04-17","2026-04-17","ILOPEZ"]
[5,"SARAS","SEPS-IGT-IGS-IGJ-INFMR-INR-INGINT-2022-003",5," Política de Administración de Riesgos Ambientales y Sociales.","literal d)","La exclusión de financiamiento para actividades económicas que no cumplan con la Política SARAS","Artículo de la Política SARAS y resolución del Consejo de Administración","ACT","2026-04-17","2026-04-17","ILOPEZ"]
[6,"SARAS","SEPS-IGT-IGS-IGJ-INFMR-INR-INGINT-2022-003",5," Política de Administración de Riesgos Ambientales y Sociales.","Literal e)","Metodología general a utilizar para la aplicación de la administración de riesgos ambiental y social hacia todas las actividades económicas financiadas","Artículo de la Política SARAS y resolución del Consejo de Administración","ACT","2026-04-17","2026-04-17","ILOPEZ"]
[7,"SARAS","SEPS-IGT-IGS-IGJ-INFMR-INR-INGINT-2022-003",5," Política de Administración de Riesgos Ambientales y Sociales.","Literal f)","Objetivo, misión, visión y alcance con respecto al ambiente y la contribución al desarrollo sostenible, roles y responsabilidades","Artículo de la Política SARAS y resolución del Consejo de Administración","ACT","2026-04-17","2026-04-17","ILOPEZ"]
{"$rows_left_out":41}
{"sheet":"CONTSEGART9","index":4,"n_rows":136,"n_cols":160,"rows_kept":136,"merged":[[0,2,0,7],[1,1,1,10],[2,1,2,10],[3,2,3,3],[3,8,3,10],[4,1,4,10],[5,1,5,10],[6,1,6,10],[7,1,7,10],[9,0,9,10],[11,1,11,8],[11,9,11,10],[13,1,13,10],[14,1,14,10],[15,1,15,10],[16,1,16,10],[17,1,17,10],[18,1,18,10],[19,1,19,10],[20,1,20,10],[21,1,21,10],[22,1,22,10],[24,0,24,10],[25,3,25,4],[25,5,25,6],[25,8,25,9],[26,1,29,1],[26,8,26,9],[27,8,27,9],[28,8,28,9],[29,8,29,9],[30,1,33,1],[30,8,30,9],[31,8,31,9],[32,8,32,9],[33,8,33,9],[34,1,42,1],[34,8,34,9],[35,8,35,9],[36,8,36,9],[37,3,37,4],[37,8,37,9],[38,3,38,4],[38,8,38,9],[39,3,39,4],[39,8,39,9],[40,3,40,4],[40,8,40,9],[41,3,41,4],[41,8,41,9],[42,3,42,4],[42,8,42,9],[43,1,44,1],[43,8,43,9],[44,8,44,9],[45,1,46,1],[45,8,45,9],[46,8,46,9],[47,1,50,1],[47,8,47,9],[48,8,48,9],[49,8,49,9],[50,8,50,9],[51,1,52,1],[51,8,51,9],[52,8,52,9],[53,1,54,1],[53,8,53,9],[54,8,54,9],[55,1,60,1],[55,8,55,9],[56,8,56,9],[57,8,57,9],[58,8,58,9],[59,8,59,9],[60,8,60,9],[61,1,61,9],[62,0,62,10],[63,0,63,1],[64,0,64,1],[65,0,65,1],[66,0,66,1],[67,0,67,1],[68,4,68,10],[69,0,69,10],[82,0,82,10],[100,0,100,10],[101,8,101,10],[103,8,103,10],[105,8,105,10],[113,8,113,10],[114,8,114,10],[116,8,116,10],[118,0,118,10],[119,1,119,3],[119,6,119,9],[121,1,121,3],[121,8,121,9],[123,1,123,3],[123,8,123,9],[124,1,124,3],[124,8,124,9],[125,1,125,3],[125,8,125,9],[126,1,126,3],[126,8,126,9],[127,1,127,3],[127,8,127,9],[128,1,128,3],[128,8,128,9],[129,1,129,3],[129,8,129,9],[130,1,130,3],[130,8,130,9],[131,1,131,3],[131,8,131,9],[132,1,132,3],[132,8,132,9],[134,1,134,3],[134,8,134,9]]}
[null,null,"Herramienta de control y seguimiento para la elaboración de informes de gestión de los Sistemas de Administración de Riesgos Ambientales y Sociales en las Cooperativas de ahorro y Crédito y Mutualistas",{"$nulls":9},"SECCION 1",{"$f":"ADDRESS(MATCH($M1,$L:$L,0)+2,2)","v":"$B$12"}]
[null,"Información general de la herramienta",{"$nulls":10},"SECCION 2",{"$f":"ADDRESS(MATCH($M2,$L:$L,0)+1,1)","v":"$A$26"}]
[null,"La presente herramienta es un formulario de referencia para el desarrollo de los informes de gestión que deben entregar las Entidades hasta el 31 de enero de cada año a la SEPS como parte del sistema de Control y Vigilancia de la Norma SARAS. Es relevante mencionar que si bien la entrega del informe se realiza en enero de cada año, el corte de información para todas las secciones de la herremienta es hasta el 31 de diciembre del año anterior. ",{"$nulls":10},"SECCION 3",{"$f":"ADDRESS(MATCH($M3,$L:$L,0),2)","v":"$B$63"}]
[null,"Usuario ","Este formulario debe ser llenado por el auditor interno, el área o quien cumpla estas funciones de acuerdo con el segmento al que pertenece la Entidad. Sin embargo, debe ser elaborado en base a los informes ambientales y sociales del Oficial SARAS. Que a su vez pueden apoyarse en el Comité de Créditos y el Comité de Administración Integral de Riesgos.",null,"Alcance",{"$nulls":3},"Este formulario representa los informes de gestión que se mencionan en la Norma SARAS y es una herramienta que busca evaluar el desempeño de la Entidad en la gestión de riesgos ambientales y sociales. Su calificación no representa un incumplimiento de la norma, sino que brinda las recomendaciones de mejora que deben ser incorporadas año a año para garantizar una adecuada gestión de los riesgos ambientales y sociales.",{"$nulls":3},"SECCION 4",{"$f":"ADDRESS(MATCH($M4,$L:$L,0)+1,2)","v":"$B$71"}]
[null,"Marco metodológico:",{"$nulls":10},"SECCION 5",{"$f":"ADDRESS(MATCH($M5,$L:$L,0)+3,2)","v":"$B$86"}]
[null,"Los criterios de evaluación planteados son una combinación de los requisitos explícitos de la norma con los criterios que plantea la Corporación Financiera Internacional IFC (World Bank) para evaluar la implementación del SARAS.\nLos criterios en azul se encuentran de forma explícita en la norma.\nLos criterios en verde son las recomendación de buenas prácticas de acuerdo al estándar internacional antes mencionado.\nSe consideró un mecanismo que facilité la evaluación del desempeño sin demandar esfuerzos significativos adicionales. ",{"$nulls":10},"SECCION 6",{"$f":"ADDRESS(MATCH($M6,$L:$L,0)+3,2)","v":"$B$104"}]
[null,"Descripción del uso de la herramienta:",{"$nulls":10},"SECCION 7",{"$f":"ADDRESS(MATCH($M7,$L:$L,0)+3,2)","v":"$B$122"}]
[null,"1. En la primera sección se debe enlistar las acciones llevadas a cabo por la entidad para fortalecer las capacidades institucionales en la implementación del SARAS.\n2. En la segunda sección: \n     *En las dos primeras columnas se especifica los criterios que evalúan la gestión del SARAS junto con el eje al que pertenece cada uno.\n     * La herramienta cuenta con un Check List que debe ser llenado con un \"Sí\" o con un \"No\" de acuerdo con el cumplimiento de cada criterio parte de la Entidad.\n     * En la columna de verificación se muestra la evidencia que debe ser entregada con el formulario para validar y comprobar el cumplimiento.\n     * La columna de calificación no debe ser modificada y muestra la calificación otorgada para cada criterio. Al final se muestra una suma de la calificación de cada criterio sobre 35 puntos. \n3. En la tercera sección se debe mencionar la información del portafolio de créditos de acuerdo a la clasificación de riesgo Alto, Medio, Bajo y las negadas por la lista de exclusión. Si no cuenta con operaciones colocar cero ( 0 ).\n4. En la cuarta sección se debe incluir la información requerida sobre las 10 operaciones de mayor monto con riesgo alto, Es decir, las operaciones con mayor riesgo ambiental y social de la Entidad.\n5. En la quinta sección se debe llenar el detalle de las operaciones que fueron admitidas para financiamiento, que hayan sido condicionadas con un Plan de Acción.\n6. En la sexta sección se debe enlistar la información correspondiente a las quejas recibidas sobre los riesgos A&S en operaciones financiadas por la entidad.\n7. En la séptima sección se debe incorporar un listado de las actividades que se desarrollaran el año entrante para mejorar la gestión del SARAS en conjunto con sus plazos y los responsables.\n\nNota. Para añadir rellene los campos y de click en el botón (+); "]
{"$rows_left_out":129}
{"sheet":"SEG","index":5,"n_rows":37,"n_cols":25,"rows_kept":37,"hidden":true}
["Id","Ejes","Criterios","Verificación","Calificación",null,"codUnico","id","calf","estadoReg","fechaCreacion","fechaActualizacion","usrCreacion",null,"VALIDAR",null,null,"id","ejes","criterios","verificacion","estadoReg","fechaCreacion","fechaActualizacion","usrCreacion"]
[1,"Implementación de la Política de Administración de Riesgos Ambientales y Sociales (Política SARAS)","¿Existe una política SARAS aprobada?","Resolución del consejo de administración",{"$f":"IF(OR(IFERROR(VLOOKUP(T_SEGUIMIENTOS[[#This Row],[Id]],$H:$I,2,FALSE),\"¡ERROR!\")=\"Error\",IFERROR(VLOOKUP(T_SEGUIMIENTOS[[#This Row],[Id]],$H:$I,2,FALSE),\"¡ERROR!\")=\"Responder\"),\"¡ERROR!\",IFERROR(VLOOKUP(T_SEGUIMIENTOS[[#This Row],[Id]],$H:$I,2,FALSE),\"¡ERROR!\"))","v":1},null,{"$f":"CONCATENATE(CumpSARAS!$C$10,CumpSARAS!$L$10)","v":"07900886110012025"},1,1,"ACT",{"$f":"TODAY()","v":"2026-04-17"},{"$f":"TODAY()","v":"2026-04-17"},"ILOPEZ",null,{"$f":"IF(COUNTIF(T_SEGUIMIENTOS[Calificación],\"<>¡ERROR!\")=36,\"VALIDADO\",\"¡ERROR!\")","v":"VALIDADO"},null,null,1,"Implementación de la Política de Administración de Riesgos Ambientales y Sociales (Política SARAS)","¿Existe una política SARAS aprobada?","Resolución del consejo de administración","ACT",{"$f":"TODAY()","v":"2026-04-17"},{"$f":"TODAY()","v":"2026-04-17"},"ILOPEZ"]
[2,"Implementación de la Política de Administración de Riesgos Ambientales y Sociales (Política SARAS)","¿Se integraron los objetivos A&S con los objetivos institucionales?","Políticas adaptadas con la gestión de riesgos A&S",{"$f":"IF(OR(IFERROR(VLOOKUP(T_SEGUIMIENTOS[[#This Row],[Id]],$H:$I,2,FALSE),\"¡ERROR!\")=\"Error\",IFERROR(VLOOKUP(T_SEGUIMIENTOS[[#This Row],[Id]],$H:$I,2,FALSE),\"¡ERROR!\")=\"Responder\"),\"¡ERROR!\",IFERROR(VLOOKUP(T_SEGUIMIENTOS[[#This Row],[Id]],$H:$I,2,FALSE),\"¡ERROR!\"))","v":1},null,{"$f":"CONCATENATE(CumpSARAS!$C$10,CumpSARAS!$L$10)","v":"07900886110012025"},2,1,"ACT",{"$f":"TODAY()","v":"2026-04-17"},"2026-04-17","ILOPEZ",null,{"$f":"COUNTIF(T_SEGUIMIENTOS[Calificación],\"<>¡ERROR!\")","v":36},null,null,2,"Implementación de la Política de Administración de Riesgos Ambientales y Sociales (Política SARAS)","¿Se integraron los objetivos A&S con los objetivos institucionales?","Políticas adaptadas con la gestión de riesgos A&S","ACT","2026-04-17","2026-04-17","ILOPEZ"]
[3,"Implementación de la Política de Administración de Riesgos Ambientales y Sociales (Política SARAS)","¿Cuál es el alcance de la Política SARAS?","Política SARAS",{"$f":"IF(OR(IFERROR(VLOOKUP(T_SEGUIMIENTOS[[#This Row],[Id]],$H:$I,2,FALSE),\"¡ERROR!\")=\"Error\",IFERROR(VLOOKUP(T_SEGUIMIENTOS[[#This Row],[Id]],$H:$I,2,FALSE),\"¡ERROR!\")=\"Responder\"),\"¡ERROR!\",IFERROR(VLOOKUP(T_SEGUIMIENTOS[[#This Row],[Id]],$H:$I,2,FALSE),\"¡ERROR!\"))","v":1},null,{"$f":"CONCATENATE(CumpSARAS!$C$10,CumpSARAS!$L$10)","v":"07900886110012025"},3,1,"ACT","2026-04-17","2026-04-17","ILOPEZ",{"$nulls":4},3,"Implementación de la Política de Administración de Riesgos Ambientales y Sociales (Política SARAS)","¿Cuál es el alcance de la Política SARAS?","Política SARAS","ACT","2026-04-17","2026-04-17","ILOPEZ"]
[4,"Implementación de la Política de Administración de Riesgos Ambientales y Sociales (Política SARAS)","¿Se comunicó la política ambiental y social a las unidades relevantes?","Evidencia y mecanismos de comunicación",{"$f":"IF(OR(IFERROR(VLOOKUP(T_SEGUIMIENTOS[[#This Row],[Id]],$H:$I,2,FALSE),\"¡ERROR!\")=\"Error\",IFERROR(VLOOKUP(T_SEGUIMIENTOS[[#This Row],[Id]],$H:$I,2,FALSE),\"¡ERROR!\")=\"Responder\"),\"¡ERROR!\",IFERROR(VLOOKUP(T_SEGUIMIENTOS[[#This Row],[Id]],$H:$I,2,FALSE),\"¡ERROR!\"))","v":1},null,{"$f":"CONCATENATE(CumpSARAS!$C$10,CumpSARAS!$L$10)","v":"07900886110012025"},4,1,"ACT","2026-04-17","2026-04-17","ILOPEZ",{"$nulls":4},4,"Implementación de la Política de Administración de Riesgos Ambientales y Sociales (Política SARAS)","¿Se comunicó la política ambiental y social a las unidades relevantes?","Evidencia y mecanismos de comunicación","ACT","2026-04-17","2026-04-17","ILOPEZ"]
[5,"Funciones y responsabilidades","¿Se asigna una función de riesgo A&S a una persona o un departamentos específico?","Resolución o comunicación de la gerencia general",{"$f":"IF(OR(IFERROR(VLOOKUP(T_SEGUIMIENTOS[[#This Row],[Id]],$H:$I,2,FALSE),\"¡ERROR!\")=\"Error\",IFERROR(VLOOKUP(T_SEGUIMIENTOS[[#This Row],[Id]],$H:$I,2,FALSE),\"¡ERROR!\")=\"Responder\"),\"¡ERROR!\",IFERROR(VLOOKUP(T_SEGUIMIENTOS[[#This Row],[Id]],$H:$I,2,FALSE),\"¡ERROR!\"))","v":1},null,{"$f":"CONCATENATE(CumpSARAS!$C$10,CumpSARAS!$L$10)","v":"07900886110012025"},5,1,"ACT","2026-04-17","2026-04-17","ILOPEZ",{"$nulls":4},5,"Funciones y responsabilidades","¿Se asigna una función de riesgo A&S a una persona o un departamentos específico?","Resolución o comunicación de la gerencia general","ACT","2026-04-17","2026-04-17","ILOPEZ"]
[6,"Funciones y responsabilidades","¿Se definen en detalle los roles y responsabilidades ambientales y sociales dentro de la organización?","Definición de funciones y responsabilidades",{"$f":"IF(OR(IFERROR(VLOOKUP(T_SEGUIMIENTOS[[#This Row],[Id]],$H:$I,2,FALSE),\"¡ERROR!\")=\"Error\",IFERROR(VLOOKUP(T_SEGUIMIENTOS[[#This Row],[Id]],$H:$I,2,FALSE),\"¡ERROR!\")=\"Responder\"),\"¡ERROR!\",IFERROR(VLOOKUP(T_SEGUIMIENTOS[[#This Row],[Id]],$H:$I,2,FALSE),\"¡ERROR!\"))","v":1},null,{"$f":"CONCATENATE(CumpSARAS!$C$10,CumpSARAS!$L$10)","v":"07900886110012025"},6,1,"ACT","2026-04-17","2026-04-17","ILOPEZ",{"$nulls":4},6,"Funciones y responsabilidades","¿Se definen en detalle los roles y responsabilidades ambientales y sociales dentro de la organización?","Definición de funciones y responsabilidades","ACT","2026-04-17","2026-04-17","ILOPEZ"]
[7,"Funciones y responsabilidades","¿Se comunica efectivamente los roles y responsabilidades ambientales y sociales dentro de la organización?","Evidencia de la comunicación",{"$f":"IF(OR(IFERROR(VLOOKUP(T_SEGUIMIENTOS[[#This Row],[Id]],$H:$I,2,FALSE),\"¡ERROR!\")=\"Error\",IFERROR(VLOOKUP(T_SEGUIMIENTOS[[#This Row],[Id]],$H:$I,2,FALSE),\"¡ERROR!\")=\"Responder\"),\"¡ERROR!\",IFERROR(VLOOKUP(T_SEGUIMIENTOS[[#This Row],[Id]],$H:$I,2,FALSE),\"¡ERROR!\"))","v":1},null,{"$f":"CONCATENATE(CumpSARAS!$C$10,CumpSARAS!$L$10)","v":"07900886110012025"},7,1,"ACT","2026-04-17","2026-04-17","ILOPEZ",{"$nulls":4},7,"Funciones y responsabilidades","¿Se comunica efectivamente los roles y responsabilidades ambientales y sociales dentro de la organización?","Evidencia de la comunicación","ACT","2026-04-17","2026-04-17","ILOPEZ"]
{"$rows_left_out":29}